Target
Metabotropic glutamate receptor 1
Ligand
BDBM50171313
Substrate
Meas. Tech.
ChEMBL_303740 (CHEMBL829783)
Ki
0.87±n/a nM
Citation
 Huang, YNarendran, RBischoff, FGuo, NZhu, ZBae, SALesage, ASLaruelle, M A positron emission tomography radioligand for the in vivo labeling of metabotropic glutamate 1 receptor: (3-ethyl-2-[11C]methyl-6-quinolinyl)(cis- 4-methoxycyclohexyl)methanone. J Med Chem 48:5096-9 (2005)  
Target
Name:
Metabotropic glutamate receptor 1
Synonyms:
GRM1_RAT Grm1 Metabotropic glutamate receptor Mglur1 metabotropic glutamate 1/5-D metabotropic glutamate receptor 1 isoform alpha precursor
Type:
Enzyme Catalytic Domain
Mol. Mass.:
133240.47
Organism:
RAT
Description:
metabotropic glutamate 1/2 0 RAT::P23385
Residue:
1199
  
Inhibitor
Name:
BDBM50171313
Synonyms:
(3-Ethyl-2-methyl-quinolin-6-yl)-(4-methoxy-cyclohexyl)-methanone | CHEMBL188906
Type:
Small organic molecule
Emp. Form.:
C20H25NO2
Mol. Mass.:
311.418
SMILES:
CCc1cc2cc(ccc2nc1C)C(=O)[C@@H]1CC[C@@H](CC1)OC
: