Target
Thyroid hormone receptor beta
Ligand
BDBM50171803
Substrate
Meas. Tech.
ChEMBL_321321 (CHEMBL882591)
IC50
1.8±n/a nM
Citation
 Hangeland, JJFriends, TJDoweyko, AMMellström, KSandberg, JGrynfarb, MRyono, DE A new class of high affinity thyromimetics containing a phenyl-naphthylene core. Bioorg Med Chem Lett 15:4579-84 (2005)  
Target
Name:
Thyroid hormone receptor beta
Synonyms:
ERBA2 Nuclear receptor subfamily 1 group A member 2 THR1 c-erbA-2 | c-erbA-beta
Type:
Receptor
Mol. Mass.:
52793.62
Organism:
Homo sapiens (Human)
Description:
Recombinant hThR was obtained from nuclear extracts from SF9 cells infected with baculovirus vectors encoding for ThRbeta 1.
Residue:
461
  
Inhibitor
Name:
BDBM50171803
Synonyms:
3-[4-(5-Bromo-6-hydroxy-naphthalen-1-yl)-3,5-dichloro-phenylamino]-propionic acid | CHEMBL198875
Type:
Small organic molecule
Emp. Form.:
C19H14BrCl2NO3
Mol. Mass.:
455.129
SMILES:
OC(=O)CCNc1cc(Cl)c(c(Cl)c1)-c1cccc2c(Br)c(O)ccc12
: