Target
Thyroid hormone receptor alpha
Ligand
BDBM50171798
Substrate
Meas. Tech.
ChEMBL_321327 (CHEMBL880611)
IC50
62±n/a nM
Citation
 Hangeland, JJFriends, TJDoweyko, AMMellström, KSandberg, JGrynfarb, MRyono, DE A new class of high affinity thyromimetics containing a phenyl-naphthylene core. Bioorg Med Chem Lett 15:4579-84 (2005)  
Target
Name:
Thyroid hormone receptor alpha
Synonyms:
C-erbA-alpha EAR7 NR1A1 THA_HUMAN THRA1 Thyroid Hormone Receptor (TR-alpha) Thyroid hormone receptor alpha c-erbA-1
Type:
Receptor
Mol. Mass.:
54818.00
Organism:
Homo sapiens (Human)
Description:
Recombinant hThR was obtained from nuclear extracts from SF9 cells infected with baculovirus vectors encoding for ThRalpha 1.
Residue:
490
  
Inhibitor
Name:
BDBM50171798
Synonyms:
CHEMBL372428 | N-[4-(5-Bromo-6-hydroxy-naphthalen-1-yl)-3,5-dichloro-phenyl]-succinamic acid
Type:
Small organic molecule
Emp. Form.:
C20H14BrCl2NO4
Mol. Mass.:
483.139
SMILES:
OC(=O)CCC(=O)Nc1cc(Cl)c(c(Cl)c1)-c1cccc2c(Br)c(O)ccc12
: