Target
Melanin-concentrating hormone receptor 2
Ligand
BDBM50172440
Substrate
Meas. Tech.
ChEMBL_321623 (CHEMBL871632)
IC50
3.7±n/a nM
Citation
 Ulven, TFrimurer, TMReceveur, JMLittle, PBRist, ONørregaard, PKHögberg, T 6-Acylamino-2-aminoquinolines as potent melanin-concentrating hormone 1 receptor antagonists. Identification, structure-activity relationship, and investigation of binding mode. J Med Chem 48:5684-97 (2005)  
Target
Name:
Melanin-concentrating hormone receptor 2
Synonyms:
GPR145 MCHR2_HUMAN Melanin-concentrating hormone receptor SLT
Type:
Enzyme Catalytic Domain
Mol. Mass.:
38862.16
Organism:
Homo sapiens (Human)
Description:
Melanin Concentrating Hormone 2 GPR145 HUMAN::Q969V1
Residue:
340
  
Inhibitor
Name:
BDBM50172440
Synonyms:
2-(2,4-Dichloro-phenoxy)-N-(4-methyl-2-piperazin-1-yl-quinolin-6-yl)-acetamide | CHEMBL196667
Type:
Small organic molecule
Emp. Form.:
C22H22Cl2N4O2
Mol. Mass.:
445.342
SMILES:
Cc1cc(nc2ccc(NC(=O)COc3ccc(Cl)cc3Cl)cc12)N1CCNCC1
: