Target
Prostaglandin G/H synthase 1
Ligand
BDBM50074922
Substrate
Meas. Tech.
ChEMBL_321330 (CHEMBL880614)
IC50
170±n/a nM
Citation
 Peretto, IRadaelli, SParini, CZandi, MRaveglia, LFDondio, GFontanella, LMisiano, PBigogno, CRizzi, ARiccardi, BBiscaioli, MMarchetti, SPuccini, PCatinella, SRondelli, ICenacchi, VBolzoni, PTCaruso, PVilletti, GFacchinetti, FDel Giudice, EMoretto, NImbimbo, BP Synthesis and biological activity of flurbiprofen analogues as selective inhibitors of beta-amyloid(1)(-)(42) secretion. J Med Chem 48:5705-20 (2005)  
Target
Name:
Prostaglandin G/H synthase 1
Synonyms:
Cox-1 Cyclooxygenase PGH1_RAT Ptgs1
Type:
Enzyme Catalytic Domain
Mol. Mass.:
69033.56
Organism:
RAT
Description:
COX-1 0 RAT::Q63921
Residue:
602
  
Inhibitor
Name:
BDBM50074922
Synonyms:
(+-)-2-fluoro-alpha-methyl-4-biphenylacetic acid 2-(2-fluorobiphenyl-4-yl)propanoic acid 3-fluoro-4-phenylhydratropic acid CHEMBL563 US9630914, Compound A
Type:
Small organic molecule
Emp. Form.:
C15H13FO2
Mol. Mass.:
244.2609
SMILES:
CC(C(O)=O)c1ccc(c(F)c1)-c1ccccc1
: