Target
Alpha-1B adrenergic receptor
Ligand
BDBM50173162
Substrate
Meas. Tech.
ChEMBL_320869 (CHEMBL884794)
Ki
103±n/a nM
Citation
 Hong, SSBavadekar, SALee, SIPatil, PNLalchandani, SGFeller, DRMiller, DD Bioisosteric phentolamine analogs as potent alpha-adrenergic antagonists. Bioorg Med Chem Lett 15:4691-5 (2005)  
Target
Name:
Alpha-1B adrenergic receptor
Synonyms:
ADA1B_HUMAN Adrenergic alpha1B Adrenergic receptor alpha Alpha 1B-adrenoreceptor | Alpha-1B adrenergic receptor
Type:
Enzyme
Mol. Mass.:
56862.13
Organism:
Homo sapiens (Human)
Description:
P35368
Residue:
520
  
Inhibitor
Name:
BDBM50173162
Synonyms:
CHEMBL362954 | N'-(4,5-Dihydro-1H-imidazol-2-yl)-N-(3-methoxy-phenyl)-N-p-tolyl-hydrazine
Type:
Small organic molecule
Emp. Form.:
C17H20N4O
Mol. Mass.:
296.3669
SMILES:
[#6]-[#8]-c1cccc(c1)-[#7](\[#7]=[#6]-1/[#7]-[#6]-[#6]-[#7]-1)-c1ccc(-[#6])cc1
: