Target
Retinoic acid receptor RXR-alpha
Ligand
BDBM50032221
Substrate
Meas. Tech.
ChEMBL_320731 (CHEMBL880876)
Kd
32±n/a nM
Citation
 Sussman, Fde Lera, AR Ligand recognition by RAR and RXR receptors: binding and selectivity. J Med Chem 48:6212-9 (2005)  
Target
Name:
Retinoic acid receptor RXR-alpha
Synonyms:
NR2B1 Nuclear receptor subfamily 4 group A member 2 RXRA Retinoic acid receptor RXR-alpha/gamma Retinoid receptor
Type:
PROTEIN
Mol. Mass.:
50820.38
Organism:
Homo sapiens (Human)
Description:
ChEMBL_1456363
Residue:
462
  
Inhibitor
Name:
BDBM50032221
Synonyms:
4-[(E)-2-(3,5,5,8,8-Pentamethyl-5,6,7,8-tetrahydro-naphthalen-2-yl)-propenyl]-benzoic acid | CHEMBL32505
Type:
Small organic molecule
Emp. Form.:
C25H30O2
Mol. Mass.:
362.5045
SMILES:
C\C(=C/c1ccc(cc1)C(O)=O)c1cc2c(cc1C)C(C)(C)CCC2(C)C
: