Target
Retinoic acid receptor RXR-alpha
Ligand
BDBM31892
Substrate
Meas. Tech.
ChEMBL_320731 (CHEMBL880876)
Kd
1.5±n/a nM
Citation
 Sussman, Fde Lera, AR Ligand recognition by RAR and RXR receptors: binding and selectivity. J Med Chem 48:6212-9 (2005)  
Target
Name:
Retinoic acid receptor RXR-alpha
Synonyms:
NR2B1 Nuclear receptor subfamily 4 group A member 2 RXRA Retinoic acid receptor RXR-alpha/gamma Retinoid receptor
Type:
PROTEIN
Mol. Mass.:
50820.38
Organism:
Homo sapiens (Human)
Description:
ChEMBL_1456363
Residue:
462
  
Inhibitor
Name:
BDBM31892
Synonyms:
9-cis retinoic acid CHEMBL705 alitretinoin
Type:
Small organic molecule
Emp. Form.:
C20H28O2
Mol. Mass.:
300.4351
SMILES:
C\C(\C=C\C1=C(C)CCCC1(C)C)=C\C=C\C(\C)=C\C(O)=O
: