Target
Mu-type opioid receptor
Ligand
BDBM50174966
Substrate
Meas. Tech.
ChEMBL_325673 (CHEMBL863227)
Ki
>5000±n/a nM
Citation
 Chu, GHGu, MCassel, JABelanger, SGraczyk, TMDeHaven, RNConway-James, NKoblish, MLittle, PJDeHaven-Hudkins, DLDolle, RE Potent and highly selective kappa opioid receptor agonists incorporating chroman- and 2,3-dihydrobenzofuran-based constraints. Bioorg Med Chem Lett 15:5114-9 (2005)  
Target
Name:
Mu-type opioid receptor
Synonyms:
M-OR-1 MOR-1 MUOR1 Mu opiate receptor OPRM1 hMOP | mu-type opioid receptor isoform MOR-1
Type:
G Protein-Coupled Receptor (GPCR)
Mol. Mass.:
44789.51
Organism:
Homo sapiens (Human)
Description:
P35372
Residue:
400
  
Inhibitor
Name:
BDBM50174966
Synonyms:
6-Methylsulfamoyl-chroman-2-carboxylic acid [(S)-2-((S)-3-hydroxy-pyrrolidin-1-yl)-1-phenyl-ethyl]-methyl-amide | CHEMBL199111
Type:
Small organic molecule
Emp. Form.:
C24H31N3O5S
Mol. Mass.:
473.585
SMILES:
CNS(=O)(=O)c1ccc2OC(CCc2c1)C(=O)N(C)[C@H](CN1CC[C@H](O)C1)c1ccccc1
: