Target
5-hydroxytryptamine receptor 2C
Ligand
BDBM50144841
Substrate
Meas. Tech.
ChEMBL_331169 (CHEMBL854096)
Ki
2.3±n/a nM
Citation
 Adams, DRBentley, JMBenwell, KRBickerdike, MJBodkin, CDCliffe, IADourish, CTGeorge, ARKennett, GAKnight, ARMalcolm, CSMansell, HLMisra, AQuirk, KRoffey, JRVickers, SP Pyrrolo(iso)quinoline derivatives as 5-HT(2C) receptor agonists. Bioorg Med Chem Lett 16:677-80 (2005)  
Target
Name:
5-hydroxytryptamine receptor 2C
Synonyms:
5-HT-2C 5-HT2C-INI 5-HTR2C 5-hydroxytryptamine receptor 2C (5-HT-2C) 5HT-1C HTR1C Serotonin (5-HT3) receptor Serotonin Receptor 2C
Type:
G Protein-Coupled Receptor (GPCR)
Mol. Mass.:
51836.79
Organism:
Homo sapiens (Human)
Description:
P28335
Residue:
458
  
Inhibitor
Name:
BDBM50144841
Synonyms:
(S)-1-(6-chloro-5-fluoro-1H-indol-1-yl)propan-2-amine CHEMBL76781 Ro-600175
Type:
Small organic molecule
Emp. Form.:
C11H12ClFN2
Mol. Mass.:
226.678
SMILES:
C[C@H](N)Cn1ccc2cc(F)c(Cl)cc12
: