Target
Lysophosphatidic acid receptor 3
Ligand
BDBM50176395
Substrate
Meas. Tech.
ChEMBL_333864 (CHEMBL865902)
Ki
489±n/a nM
Citation
 Durgam, GGTsukahara, RMakarova, NWalker, MDFujiwara, YPigg, KRBaker, DLSardar, VMParrill, ALTigyi, GMiller, DD Synthesis and pharmacological evaluation of second-generation phosphatidic acid derivatives as lysophosphatidic acid receptor ligands. Bioorg Med Chem Lett 16:633-40 (2005)  
Target
Name:
Lysophosphatidic acid receptor 3
Synonyms:
EDG7 LPAR3 Lysophosphatidic acid receptor 1/3 Lysophosphatidic acid receptor Edg-7
Type:
Enzyme
Mol. Mass.:
40149.72
Organism:
Homo sapiens (Human)
Description:
Q9UBY5
Residue:
353
  
Inhibitor
Name:
BDBM50176395
Synonyms:
CHEMBL202251 | phosphoric acid mono-((R)-2-octanoylamino-2-octylcarbamoyl-ethyl) ester
Type:
Small organic molecule
Emp. Form.:
C19H39N2O6P
Mol. Mass.:
422.4965
SMILES:
CCCCCCCCNC(=O)[C@@H](COP(O)(O)=O)NC(=O)CCCCCCC
: