Target
Amyloid-beta precursor protein
Ligand
BDBM50100134
Substrate
Meas. Tech.
ChEMBL_430883 (CHEMBL913952)
Ki
>1000±n/a nM
Citation
 Ono, MYoshida, NIshibashi, KHaratake, MArano, YMori, HNakayama, M Radioiodinated flavones for in vivo imaging of beta-amyloid plaques in the brain. J Med Chem 48:7253-60 (2005)  
Target
Name:
Amyloid-beta precursor protein
Synonyms:
A4 ABPP AICD-50 AICD-59 AID(57) APP Alzheimer disease amyloid protein Amyloid beta Protein Amyloid beta protein Abeta(1-42) Amyloid intracellular domain 57 Amyloid protein (Abeta42b) Beta amyloid A4 protein Beta-APP42 Beta-amyloid protein 42 C83 CVAP Gamma Secretase Gamma-CTF(57) Gamma-secretase Gamma-secretase C-terminal fragment 57 P3(40) PN-II Protease nexin-II S-APP-beta Soluble APP-beta | beta-Amyloid Precursor Protein (APP)
Type:
Single-pass type I membrane protein
Mol. Mass.:
86890.41
Organism:
Homo sapiens (Human)
Description:
P05067
Residue:
770
  
Inhibitor
Name:
BDBM50100134
Synonyms:
2-(4-Dimethylamino-phenyl)-3,6-dimethyl-benzothiazol-3-ium 2-[4-(dimethylamino)phenyl]-3,6-dimethyl-1,3-benzothiazol-3-ium CHEMBL57267 Thioflavin T, 1 cid_16954
Type:
Small organic molecule
Emp. Form.:
C17H19N2S
Mol. Mass.:
283.411
SMILES:
CN(C)c1ccc(cc1)-c1sc2cc(C)ccc2[n+]1C
: