Target
Amyloid-beta precursor protein
Ligand
BDBM50176895
Substrate
Meas. Tech.
ChEMBL_430883 (CHEMBL913952)
Ki
77.2±n/a nM
Citation
 Ono, MYoshida, NIshibashi, KHaratake, MArano, YMori, HNakayama, M Radioiodinated flavones for in vivo imaging of beta-amyloid plaques in the brain. J Med Chem 48:7253-60 (2005)  
Target
Name:
Amyloid-beta precursor protein
Synonyms:
A4 ABPP AICD-50 AICD-59 AID(57) APP Alzheimer disease amyloid protein Amyloid beta Protein Amyloid beta protein Abeta(1-42) Amyloid intracellular domain 57 Amyloid protein (Abeta42b) Beta amyloid A4 protein Beta-APP42 Beta-amyloid protein 42 C83 CVAP Gamma Secretase Gamma-CTF(57) Gamma-secretase Gamma-secretase C-terminal fragment 57 P3(40) PN-II Protease nexin-II S-APP-beta Soluble APP-beta | beta-Amyloid Precursor Protein (APP)
Type:
Single-pass type I membrane protein
Mol. Mass.:
86890.41
Organism:
Homo sapiens (Human)
Description:
P05067
Residue:
770
  
Inhibitor
Name:
BDBM50176895
Synonyms:
6-iodo-4'-hydroxyflavone | CHEMBL388844
Type:
Small organic molecule
Emp. Form.:
C15H9IO3
Mol. Mass.:
364.1346
SMILES:
Oc1ccc(cc1)-c1cc(=O)c2cc(I)ccc2o1
: