Target
Cannabinoid receptor 1
Ligand
BDBM50176979
Substrate
Meas. Tech.
ChEMBL_430951 (CHEMBL914893)
Ki
0.0052±n/a nM
Citation
 Murineddu, GRuiu, SLoriga, GManca, ILazzari, PReali, RPani, LToma, LPinna, GA Tricyclic pyrazoles. 3. Synthesis, biological evaluation, and molecular modeling of analogues of the cannabinoid antagonist 8-chloro-1-(2',4'-dichlorophenyl)-N-piperidin-1-yl-1,4,5,6-tetrahydrobenzo[6,7]cyclohepta[1,2-c]pyrazole-3-carboxamide. J Med Chem 48:7351-62 (2005)  
Target
Name:
Cannabinoid receptor 1
Synonyms:
Brain-type cannabinoid receptor CB-R CNR1_MOUSE Cannabinoid receptor | Cnr1
Type:
Enzyme
Mol. Mass.:
52842.52
Organism:
Mus musculus (Mouse)
Description:
P47746
Residue:
473
  
Inhibitor
Name:
BDBM50176979
Synonyms:
8-methyl-1-(2',4'-dichlorophenyl)-N-piperidin-1-yl-1,4,5,6-tetrahydrobenzo[6,7]cyclohepta[1,2-c]pyrazole-3-carboxamide | CHEMBL224609
Type:
Small organic molecule
Emp. Form.:
C25H26Cl2N4O
Mol. Mass.:
469.406
SMILES:
Cc1ccc2-c3c(CCCc2c1)c(nn3-c1ccc(Cl)cc1Cl)C(=O)NN1CCCCC1
: