Target
Lysophosphatidic acid receptor 1
Ligand
BDBM50177331
Substrate
Meas. Tech.
ChEMBL_329844 (CHEMBL862793)
Ki
652±n/a nM
Citation
 Gududuru, VZeng, KTsukahara, RMakarova, NFujiwara, YPigg, KRBaker, DLTigyi, GMiller, DD Identification of Darmstoff analogs as selective agonists and antagonists of lysophosphatidic acid receptors. Bioorg Med Chem Lett 16:451-6 (2005)  
Target
Name:
Lysophosphatidic acid receptor 1
Synonyms:
Edg2 LPAR1_RAT Lpar1 Lysophosphatidic acid receptor Edg-2
Type:
PROTEIN
Mol. Mass.:
41130.42
Organism:
Rattus norvegicus
Description:
ChEMBL_329844
Residue:
364
  
Inhibitor
Name:
BDBM50177331
Synonyms:
CHEMBL381470 | potassium (2-dodecyl-1,3-dioxolan-4-yl)methyl hydrogenphosphate
Type:
Small organic molecule
Emp. Form.:
C16H32O6P
Mol. Mass.:
351.396
SMILES:
CCCCCCCCCCCCC1OCC(COP(O)([O-])=O)O1
: