Target
Substance-P receptor
Ligand
BDBM50178565
Substrate
Meas. Tech.
ChEMBL_337893 (CHEMBL868375)
Ki
0.58±n/a nM
Citation
 Hoffmann, TBös, MStadler, HSchnider, PHunkeler, WGodel, TGalley, GBallard, TMHiggins, GAPoli, SMSleight, AJ Design and synthesis of a novel, achiral class of highly potent and selective, orally active neurokinin-1 receptor antagonists. Bioorg Med Chem Lett 16:1362-5 (2006)  
Target
Name:
Substance-P receptor
Synonyms:
NK-1 receptor NK1 Receptor NK1R_HUMAN Neurokinin-1 (NK-1) SPR TACR1 Tachykinin receptor 1 (NK1) | tachykinin
Type:
G Protein-Coupled Receptor (GPCR)
Mol. Mass.:
46254.43
Organism:
Homo sapiens (Human)
Description:
P25103
Residue:
407
  
Inhibitor
Name:
BDBM50178565
Synonyms:
CHEMBL206488 | N-(3,5-bis(trifluoromethyl)benzyl)-N-methyl-6-(4-methylpiperazin-1-yl)-4-o-tolylnicotinamide
Type:
Small organic molecule
Emp. Form.:
C28H28F6N4O
Mol. Mass.:
550.5385
SMILES:
CN(Cc1cc(cc(c1)C(F)(F)F)C(F)(F)F)C(=O)c1cnc(cc1-c1ccccc1C)N1CCN(C)CC1
: