Target
Mu-type opioid receptor
Ligand
BDBM50179186
Substrate
Meas. Tech.
ChEMBL_325358 (CHEMBL861058)
IC50
245±n/a nM
Citation
 Balboni, GGuerrini, RSalvadori, SNegri, LGiannini, EBryant, SDJinsmaa, YLazarus, LH Conversion of the potent delta-opioid agonist H-Dmt-Tic-NH-CH(2)-bid into delta-opioid antagonists by N(1)-benzimidazole alkylation(1). J Med Chem 48:8112-4 (2005)  
Target
Name:
Mu-type opioid receptor
Synonyms:
M-OR-1 Mu opioid receptor OPIATE Mu OPRM_CAVPO
Type:
Enzyme Catalytic Domain
Mol. Mass.:
11165.58
Organism:
GUINEA PIG
Description:
P97266
Residue:
98
  
Inhibitor
Name:
BDBM50179186
Synonyms:
(S)-2-((S)-2-amino-3-(4-hydroxy-2,6-dimethylphenyl)propanoyl)-N-((1-benzyl-1H-benzo[d]imidazol-2-yl)methyl)-1,2,3,4-tetrahydroisoquinoline-3-carboxamide | CHEMBL436063
Type:
Small organic molecule
Emp. Form.:
C36H37N5O3
Mol. Mass.:
587.7107
SMILES:
Cc1cc(O)cc(C)c1C[C@H](N)C(=O)N1Cc2ccccc2C[C@H]1C(=O)NCc1nc2ccccc2n1Cc1ccccc1
: