Target
Polyunsaturated fatty acid 5-lipoxygenase
Ligand
BDBM50182299
Substrate
Meas. Tech.
ChEMBL_351709 (CHEMBL870098)
IC50
3.7±n/a nM
Citation
 Grimm, ELBrideau, CChauret, NChan, CCDelorme, DDucharme, YEthier, DFalgueyret, JPFriesen, RWGuay, JHamel, PRiendeau, DSoucy-Breau, CTagari, PGirard, Y Substituted coumarins as potent 5-lipoxygenase inhibitors. Bioorg Med Chem Lett 16:2528-31 (2006)  
Target
Name:
Polyunsaturated fatty acid 5-lipoxygenase
Synonyms:
5-LO 5-Lipoxygenase (5-LO) 5-Lipoygenase ALOX5 LOG5 | LOX5_HUMAN
Type:
Enzyme
Mol. Mass.:
77972.74
Organism:
Homo sapiens (Human)
Description:
Recombinant protein was purified from E. coli lysate. After ammonium sulfate precipitation and subsequent steps, the supernatant (S100) was used for 5-LO activity assay.
Residue:
674
  
Inhibitor
Name:
BDBM50182299
Synonyms:
7-((3-fluoro-5-(1-hydroxy-1-(pyridin-2-yl)propyl)phenoxy)methyl)-4-(furan-3-yl)-2H-chromen-2-one | CHEMBL204633
Type:
Small organic molecule
Emp. Form.:
C28H22FNO5
Mol. Mass.:
471.4764
SMILES:
CCC(O)(c1cc(F)cc(OCc2ccc3c(cc(=O)oc3c2)-c2ccoc2)c1)c1ccccn1
: