Target
Prostaglandin D2 receptor
Ligand
BDBM50184213
Substrate
Meas. Tech.
ChEMBL_364757 (CHEMBL871219)
Ki
1.7±n/a nM
Citation
 Sturino, CFLachance, NBoyd, MBerthelette, CLabelle, MLi, LRoy, BScheigetz, JTsou, NBrideau, CCauchon, ECarriere, MCDenis, DGreig, GKargman, SLamontagne, SMathieu, MCSawyer, NSlipetz, DO'Neill, GWang, ZZamboni, RMetters, KMYoung, RN Identification of an indole series of prostaglandin D2 receptor antagonists. Bioorg Med Chem Lett 16:3043-8 (2006)  
Target
Name:
Prostaglandin D2 receptor
Synonyms:
PD2R_HUMAN Prostaglandin D2 Prostanoid DP receptor
Type:
Enzyme
Mol. Mass.:
40288.87
Organism:
Homo sapiens (Human)
Description:
Q13258
Residue:
359
  
Inhibitor
Name:
BDBM50184213
Synonyms:
2-(9-(4-chlorobenzyl)-8-isopropyl-2,3,4,9-tetrahydro-1H-carbazol-1-yl)acetic acid | CHEMBL267820
Type:
Small organic molecule
Emp. Form.:
C24H26ClNO2
Mol. Mass.:
395.922
SMILES:
CC(C)c1cccc2c3CCCC(CC(O)=O)c3n(Cc3ccc(Cl)cc3)c12
: