Target
Prostaglandin D2 receptor
Ligand
BDBM50184236
Substrate
Meas. Tech.
ChEMBL_364757 (CHEMBL871219)
Ki
1.7±n/a nM
Citation
 Sturino, CFLachance, NBoyd, MBerthelette, CLabelle, MLi, LRoy, BScheigetz, JTsou, NBrideau, CCauchon, ECarriere, MCDenis, DGreig, GKargman, SLamontagne, SMathieu, MCSawyer, NSlipetz, DO'Neill, GWang, ZZamboni, RMetters, KMYoung, RN Identification of an indole series of prostaglandin D2 receptor antagonists. Bioorg Med Chem Lett 16:3043-8 (2006)  
Target
Name:
Prostaglandin D2 receptor
Synonyms:
PD2R_HUMAN Prostaglandin D2 Prostanoid DP receptor
Type:
Enzyme
Mol. Mass.:
40288.87
Organism:
Homo sapiens (Human)
Description:
Q13258
Residue:
359
  
Inhibitor
Name:
BDBM50184236
Synonyms:
2-(4-(4-chlorobenzyl)-5-bromo-7-(methylsulfonyl)-1,2,3,4-tetrahydrocyclopenta[b]indol-3-yl)acetic acid | CHEMBL206040
Type:
Small organic molecule
Emp. Form.:
C21H19BrClNO4S
Mol. Mass.:
496.802
SMILES:
CS(=O)(=O)c1cc(Br)c2n(Cc3ccc(Cl)cc3)c3C(CC(O)=O)CCc3c2c1
: