Target
Thromboxane A2 receptor
Ligand
BDBM50184241
Substrate
Meas. Tech.
ChEMBL_364758 (CHEMBL871220)
Ki
2.6±n/a nM
Citation
 Sturino, CFLachance, NBoyd, MBerthelette, CLabelle, MLi, LRoy, BScheigetz, JTsou, NBrideau, CCauchon, ECarriere, MCDenis, DGreig, GKargman, SLamontagne, SMathieu, MCSawyer, NSlipetz, DO'Neill, GWang, ZZamboni, RMetters, KMYoung, RN Identification of an indole series of prostaglandin D2 receptor antagonists. Bioorg Med Chem Lett 16:3043-8 (2006)  
Target
Name:
Thromboxane A2 receptor
Synonyms:
Prostanoid TP receptor TBXA2R Thromboxane Thromboxane Beta
Type:
Enyzme
Mol. Mass.:
37445.28
Organism:
Homo sapiens (Human)
Description:
P21731
Residue:
343
  
Inhibitor
Name:
BDBM50184241
Synonyms:
2-(9-(4-chlorobenzyl)-8-(methylthio)-2,3,4,9-tetrahydro-1H-carbazol-1-yl)acetic acid | CHEMBL377072
Type:
Small organic molecule
Emp. Form.:
C22H22ClNO2S
Mol. Mass.:
399.934
SMILES:
CSc1cccc2c3CCCC(CC(O)=O)c3n(Cc3ccc(Cl)cc3)c12
: