Target
Cytosolic phospholipase A2
Ligand
BDBM50185345
Substrate
Meas. Tech.
ChEMBL_341906 (CHEMBL863829)
IC50
15±n/a nM
Citation
 Ludwig, JBovens, SBrauch, CElfringhoff, ASLehr, M Design and synthesis of 1-indol-1-yl-propan-2-ones as inhibitors of human cytosolic phospholipase A2alpha. J Med Chem 49:2611-20 (2006)  
Target
Name:
Cytosolic phospholipase A2
Synonyms:
CPLA2 PA24A_HUMAN PLA2G4A Phospholipase A2 | Phospholipase A2 group IVA
Type:
Protein
Mol. Mass.:
85219.30
Organism:
Homo sapiens (Human)
Description:
P47712
Residue:
749
  
Inhibitor
Name:
BDBM50185345
Synonyms:
3-cyano-1-(3-(4-octylphenoxy)-2-oxopropyl)-1H-indole-5-carboxylic acid CHEMBL381294
Type:
Small organic molecule
Emp. Form.:
C27H30N2O4
Mol. Mass.:
446.5381
SMILES:
CCCCCCCCc1ccc(OCC(=O)Cn2cc(C#N)c3cc(ccc23)C(O)=O)cc1
: