Target
Beta-1/Beta-2/Beta-3 adrenergic receptor
Ligand
BDBM50187377
Substrate
Meas. Tech.
ChEMBL_357781 (CHEMBL859038)
Ki
>2000±n/a nM
Citation
 Becker, OMDhanoa, DSMarantz, YChen, DShacham, SCheruku, SHeifetz, AMohanty, PFichman, MSharadendu, ANudelman, RKauffman, MNoiman, S An integrated in silico 3D model-driven discovery of a novel, potent, and selective amidosulfonamide 5-HT1A agonist (PRX-00023) for the treatment of anxiety and depression. J Med Chem 49:3116-35 (2006)  
Target
Name:
Beta-1/Beta-2/Beta-3 adrenergic receptor
Synonyms:
Adrenergic receptor beta
Type:
Mol. Mass.:
Description:
ASSAY_ID of ChEMBL is 305577
Components:
This complex has 3 components.
Component 1
Name:
Beta-2 adrenergic receptor
Synonyms:
ADRB2 ADRB2_HUMAN Beta-2 adrenoceptor | Beta-2 adrenoreceptor
Type:
Mol. Mass.:
46461.69
Organism:
Homo sapiens (Human)
Description:
P07550
Residue:
413
  
Component 2
Name:
Beta-1 adrenergic receptor
Synonyms:
ADRB1 ADRB1_HUMAN Beta-1 adrenoceptor | adrenergic Beta1
Type:
G Protein-Coupled Receptor (GPCR)
Mol. Mass.:
51338.40
Organism:
Homo sapiens (Human)
Description:
P08588
Residue:
477
  
Component 3
Name:
Beta-3 adrenergic receptor
Synonyms:
ADRB3 ADRB3_HUMAN Beta-2 adrenergic receptor and beta-3 adrenergic receptor Beta-3 adrenoreceptor | adrenergic Beta3
Type:
G Protein-Coupled Receptor (GPCR)
Mol. Mass.:
43534.88
Organism:
Homo sapiens (Human)
Description:
Residue:
408
  
Inhibitor
Name:
BDBM50187377
Synonyms:
CHEMBL209821 N-{3-[4-(4-cyclohexylmethanesulfonylamino-butyl)-piperazin-1-yl]-phenyl}-acetamide
Type:
Small organic molecule
Emp. Form.:
C23H38N4O3S
Mol. Mass.:
450.638
SMILES:
CC(=O)Nc1cccc(c1)N1CCN(CCCCNS(=O)(=O)CC2CCCCC2)CC1
: