Target
Galanin receptor type 3
Ligand
BDBM50187916
Substrate
Meas. Tech.
ChEMBL_384498 (CHEMBL866716)
Ki
29±n/a nM
Citation
 Konkel, MJPackiarajan, MChen, HTopiwala, UPJimenez, HTalisman, IJCoate, HWalker, MW Amino substituted analogs of 1-phenyl-3-phenylimino-2-indolones with potent galanin Gal3 receptor binding affinity and improved solubility. Bioorg Med Chem Lett 16:3950-4 (2006)  
Target
Name:
Galanin receptor type 3
Synonyms:
GALNR3 GALR3_HUMAN Galanin receptor 3 | Galanin receptor type 3
Type:
Enzyme Catalytic Domain
Mol. Mass.:
39599.97
Organism:
Homo sapiens (Human)
Description:
Galanin R3 GALR3 HUMAN::O60755
Residue:
368
  
Inhibitor
Name:
BDBM50187916
Synonyms:
1-(3-(3-(dimethylamino)propoxy)phenyl)-3-(3-(trifluoromethyl)phenylimino)indolin-2-one | CHEMBL377468
Type:
Small organic molecule
Emp. Form.:
C26H24F3N3O2
Mol. Mass.:
467.4829
SMILES:
CN(C)CCCOc1cccc(c1)N1C(=O)\C(=N\c2cccc(c2)C(F)(F)F)c2ccccc12
: