Target
D(2) dopamine receptor
Ligand
BDBM50188478
Substrate
Meas. Tech.
ChEMBL_363784 (CHEMBL860507)
Ki
140±n/a nM
Citation
 Schlotter, KBoeckler, FHübner, HGmeiner, P Fancy bioisosteres: novel paracyclophane derivatives as super-affinity dopamine D3 receptor antagonists. J Med Chem 49:3628-35 (2006)  
Target
Name:
D(2) dopamine receptor
Synonyms:
D(2) dopamine receptor DOPAMINE D2 Long DRD2 Dopamine D2 receptor Dopamine D2 receptor (D2R) Dopamine2-like | d2
Type:
Cell-surface receptors
Mol. Mass.:
50647.10
Organism:
Homo sapiens (Human)
Description:
P14416
Residue:
443
  
Inhibitor
Name:
BDBM50188478
Synonyms:
CHEMBL210461 | N-[4-(4-(2,3-dichlorophenyl)piperazin-1-yl]butyl][2.2]-paracyclophane-4-carboxamide
Type:
Small organic molecule
Emp. Form.:
C31H35Cl2N3O
Mol. Mass.:
536.535
SMILES:
Clc1cccc(N2CCN(CCCCNC(=O)c3cc4CCc5ccc(CCc3cc4)cc5)CC2)c1Cl
: