Target
5-hydroxytryptamine receptor 2A
Ligand
BDBM21342
Substrate
Meas. Tech.
ChEMBL_371426 (CHEMBL871423)
Ki
3.5±n/a nM
Citation
 McLean, THChambers, JJParrish, JCBraden, MRMarona-Lewicka, DKurrasch-Orbaugh, DNichols, DE C-(4,5,6-trimethoxyindan-1-yl)methanamine: a mescaline analogue designed using a homology model of the 5-HT2A receptor. J Med Chem 49:4269-74 (2006)  
Target
Name:
5-hydroxytryptamine receptor 2A
Synonyms:
5-HT-2A 5-HT2A 5-hydroxytryptamine receptor 2A (5HT2A) Htr2 Serotonin Receptor 2A
Type:
G Protein-Coupled Receptor (GPCR)
Mol. Mass.:
52852.05
Organism:
Rattus norvegicus (rat)
Description:
Rat cortex membranes 5-HT2A receptors.
Residue:
471
  
Inhibitor
Name:
BDBM21342
Synonyms:
(4R,7R)-N,N-diethyl-6-methyl-6,11-diazatetracyclo[7.6.1.0^{2,7}.0^{12,16}]hexadeca-1(16),2,9,12,14-pentaene-4-carboxamide LSD LSD,(+) Lysergic Acid Diethylamide [3H]-LSD | d-Isolysergic acid amide
Type:
radiolabeled ligand
Emp. Form.:
C20H25N3O
Mol. Mass.:
323.432
SMILES:
[H][C@@]12Cc3c[nH]c4cccc(C1=C[C@H](CN2C)C(=O)N(CC)CC)c34
: