Target
Melanocortin receptor 3
Ligand
BDBM50191562
Substrate
Meas. Tech.
ChEMBL_376972 (CHEMBL853375)
Ki
7163±n/a nM
Citation
 Tian, XField, TBSwitzer, AGMazur, AWEbetino, FHWos, JABerberich, SMJayasinghe, LRObringer, CMDowty, MEPinney, BBFarmer, JACrossdoersen, DSheldon, RJ Design, synthesis, and evaluation of proline and pyrrolidine based melanocortin receptor agonists. A conformationally restricted dipeptide mimic approach. J Med Chem 49:4745-61 (2006)  
Target
Name:
Melanocortin receptor 3
Synonyms:
MC3-R MC3R_HUMAN Melanocortin receptor (M3 and M4)
Type:
Enzyme
Mol. Mass.:
36044.86
Organism:
Homo sapiens (Human)
Description:
P41968
Residue:
323
  
Inhibitor
Name:
BDBM50191562
Synonyms:
(S)-N-((R)-1-((2R,4S)-2-(3-guanidinopropyl)-4-(naphthalen-2-ylmethoxy)pyrrolidin-1-yl)-1-oxo-3-phenylpropan-2-yl)piperidine-2-carboxamide | CHEMBL210009
Type:
Small organic molecule
Emp. Form.:
C34H44N6O3
Mol. Mass.:
584.7516
SMILES:
[#7]\[#6](-[#7])=[#7]\[#6]-[#6]-[#6]-[#6@@H]-1-[#6]-[#6@@H](-[#6]-[#7]-1-[#6](=O)-[#6@@H](-[#6]-c1ccccc1)-[#7]-[#6](=O)-[#6]-1-[#6]-[#6]-[#6]-[#6]-[#7]-1)-[#8]-[#6]-c1ccc2ccccc2c1
: