Target
Oxysterols receptor LXR-beta
Ligand
BDBM50192139
Substrate
Meas. Tech.
ChEMBL_406040 (CHEMBL912144)
IC50
50±n/a nM
Citation
 Panday, NBenz, JBlum-Kaelin, DBourgeaux, VDehmlow, HHartman, PKuhn, BRatni, HWarot, XWright, MB Synthesis and evaluation of anilinohexafluoroisopropanols as activators/modulators of LXRalpha and beta. Bioorg Med Chem Lett 16:5231-7 (2006)  
Target
Name:
Oxysterols receptor LXR-beta
Synonyms:
LXRB Liver X, LXR beta NR1H2 Nuclear receptor NER Ubiquitously-expressed nuclear receptor
Type:
Enzyme Catalytic Domain
Mol. Mass.:
50978.79
Organism:
Homo sapiens (Human)
Description:
P55055
Residue:
460
  
Inhibitor
Name:
BDBM50192139
Synonyms:
CHEMBL214687 | methyl 3-(4-(2-((2-chloro-4-(1,1,1,3,3,3-hexafluoro-2-hydroxypropan-2-yl)phenyl)(ethyl)amino)-2-phenylethoxy)phenyl)propanoate
Type:
Small organic molecule
Emp. Form.:
C29H28ClF6NO4
Mol. Mass.:
603.98
SMILES:
CCN(C(COc1ccc(CCC(=O)OC)cc1)c1ccccc1)c1ccc(cc1Cl)C(O)(C(F)(F)F)C(F)(F)F
: