Target
Oxysterols receptor LXR-beta
Ligand
BDBM50192148
Substrate
Meas. Tech.
ChEMBL_406040 (CHEMBL912144)
IC50
2±n/a nM
Citation
 Panday, NBenz, JBlum-Kaelin, DBourgeaux, VDehmlow, HHartman, PKuhn, BRatni, HWarot, XWright, MB Synthesis and evaluation of anilinohexafluoroisopropanols as activators/modulators of LXRalpha and beta. Bioorg Med Chem Lett 16:5231-7 (2006)  
Target
Name:
Oxysterols receptor LXR-beta
Synonyms:
LXRB Liver X, LXR beta NR1H2 Nuclear receptor NER Ubiquitously-expressed nuclear receptor
Type:
Enzyme Catalytic Domain
Mol. Mass.:
50978.79
Organism:
Homo sapiens (Human)
Description:
P55055
Residue:
460
  
Inhibitor
Name:
BDBM50192148
Synonyms:
2-(3-chloro-4-(ethyl(thiazol-4-ylmethyl)amino)phenyl)-1,1,1,3,3,3-hexafluoropropan-2-ol | CHEMBL215036
Type:
Small organic molecule
Emp. Form.:
C15H13ClF6N2OS
Mol. Mass.:
418.785
SMILES:
CCN(Cc1cscn1)c1ccc(cc1Cl)C(O)(C(F)(F)F)C(F)(F)F
: