Target
11-beta-hydroxysteroid dehydrogenase 1
Ligand
BDBM50192789
Substrate
Meas. Tech.
ChEMBL_422284 (CHEMBL856010)
IC50
41±n/a nM
Citation
 Yeh, VSPatel, JRYong, HKurukulasuriya, RFung, SMonzon, KChiou, WWang, JStolarik, DImade, HBeno, DBrune, MJacobson, PSham, HLink, JT Synthesis and biological evaluation of heterocycle containing adamantane 11beta-HSD1 inhibitors. Bioorg Med Chem Lett 16:5414-9 (2006)  
Target
Name:
11-beta-hydroxysteroid dehydrogenase 1
Synonyms:
11-DH 11-beta-Hydroxysteroid Dehydrogenase 1 (11-beta-HSD1) 11-beta-hydroxysteroid dehydrogenase 1 (11HSD1) Corticosteroid 11-beta-dehydrogenase isozyme 1 (11-beta-HSD-1) Corticosteroid 11-beta-dehydrogenase isozyme 1 (11beta-HSD1) HSD11 HSD11L | SDR26C1
Type:
Enzyme
Mol. Mass.:
32409.16
Organism:
Homo sapiens (Human)
Description:
P28845
Residue:
292
  
Inhibitor
Name:
BDBM50192789
Synonyms:
2-(4-chloro-phenoxy)-2-methyl-N-[(1S,2S,5R,7S)-5-(1H-tetrazol-5-ylmethyl)-adamantan-2-yl]-propionamide | CHEMBL424931
Type:
Small organic molecule
Emp. Form.:
C22H28ClN5O2
Mol. Mass.:
429.943
SMILES:
CC(C)(Oc1ccc(Cl)cc1)C(=O)N[C@H]1C2C[C@@H]3C[C@H]1C[C@](Cc1nnn[nH]1)(C3)C2
: