Target
11-beta-hydroxysteroid dehydrogenase 1
Ligand
BDBM50192796
Substrate
Meas. Tech.
ChEMBL_422284 (CHEMBL856010)
IC50
146±n/a nM
Citation
 Yeh, VSPatel, JRYong, HKurukulasuriya, RFung, SMonzon, KChiou, WWang, JStolarik, DImade, HBeno, DBrune, MJacobson, PSham, HLink, JT Synthesis and biological evaluation of heterocycle containing adamantane 11beta-HSD1 inhibitors. Bioorg Med Chem Lett 16:5414-9 (2006)  
Target
Name:
11-beta-hydroxysteroid dehydrogenase 1
Synonyms:
11-DH 11-beta-Hydroxysteroid Dehydrogenase 1 (11-beta-HSD1) 11-beta-hydroxysteroid dehydrogenase 1 (11HSD1) Corticosteroid 11-beta-dehydrogenase isozyme 1 (11-beta-HSD-1) Corticosteroid 11-beta-dehydrogenase isozyme 1 (11beta-HSD1) HSD11 HSD11L | SDR26C1
Type:
Enzyme
Mol. Mass.:
32409.16
Organism:
Homo sapiens (Human)
Description:
P28845
Residue:
292
  
Inhibitor
Name:
BDBM50192796
Synonyms:
CHEMBL219575 | N-[(1R,2S,5S,7S)-5-(5-amino-4-cyano-oxazol-2-yl)-adamantan-2-yl]-2-(4-chloro-phenoxy)-2-methyl-propionamide
Type:
Small organic molecule
Emp. Form.:
C24H27ClN4O3
Mol. Mass.:
454.949
SMILES:
CC(C)(Oc1ccc(Cl)cc1)C(=O)N[C@H]1C2C[C@@H]3C[C@H]1C[C@](C3)(C2)c1nc(C#N)c(N)o1
: