Target
11-beta-hydroxysteroid dehydrogenase 1
Ligand
BDBM50192799
Substrate
Meas. Tech.
ChEMBL_422284 (CHEMBL856010)
IC50
47±n/a nM
Citation
 Yeh, VSPatel, JRYong, HKurukulasuriya, RFung, SMonzon, KChiou, WWang, JStolarik, DImade, HBeno, DBrune, MJacobson, PSham, HLink, JT Synthesis and biological evaluation of heterocycle containing adamantane 11beta-HSD1 inhibitors. Bioorg Med Chem Lett 16:5414-9 (2006)  
Target
Name:
11-beta-hydroxysteroid dehydrogenase 1
Synonyms:
11-DH 11-beta-Hydroxysteroid Dehydrogenase 1 (11-beta-HSD1) 11-beta-hydroxysteroid dehydrogenase 1 (11HSD1) Corticosteroid 11-beta-dehydrogenase isozyme 1 (11-beta-HSD-1) Corticosteroid 11-beta-dehydrogenase isozyme 1 (11beta-HSD1) HSD11 HSD11L | SDR26C1
Type:
Enzyme
Mol. Mass.:
32409.16
Organism:
Homo sapiens (Human)
Description:
P28845
Residue:
292
  
Inhibitor
Name:
BDBM50192799
Synonyms:
CHEMBL375979 | N-((1R,2S,5R,7S)-5-carbamoylmethyl-adamantan-2-yl)-2-(6-morpholin-4-yl-pyridin-3-yl)-isobutyramide
Type:
Small organic molecule
Emp. Form.:
C25H36N4O3
Mol. Mass.:
440.5783
SMILES:
CC(C)(C(=O)N[C@H]1C2C[C@@H]3C[C@H]1C[C@](CC(N)=O)(C3)C2)c1ccc(nc1)N1CCOCC1
: