Target
Delta-type opioid receptor
Ligand
BDBM50194232
Substrate
Meas. Tech.
ChEMBL_392436 (CHEMBL913211)
IC50
0.390000±n/a nM
Citation
 Thomas, JBZhang, LNavarro, HACarroll, FI Highly potent and selective phenylmorphan-based inverse agonists of the opioid delta receptor. J Med Chem 49:5597-609 (2006)  
Target
Name:
Delta-type opioid receptor
Synonyms:
D-OR-1 Delta opioid receptor OPIATE Delta OPRD1 OPRK1 | opioid receptor, delta 1
Type:
G Protein-Coupled Receptor (GPCR)
Mol. Mass.:
40382.98
Organism:
Homo sapiens (Human)
Description:
Competition binding assays were carried out using membrane preparations from transfected HN9.10 cells that constitutively expressed the delta opioid receptor.
Residue:
372
  
Inhibitor
Name:
BDBM50194232
Synonyms:
(+)-N-[(1S,4R,5R,7S)-5-(3-hydroxyphenyl)-4-methyl-2-(3-phenylpropyl)-2-azabicyclo[3.3.1]non-7-yl]-1-phenyl-1-cycloheptanecarboxamide | CHEMBL377540
Type:
Small organic molecule
Emp. Form.:
C38H48N2O2
Mol. Mass.:
564.7999
SMILES:
C[C@H]1CN(CCCc2ccccc2)[C@@H]2C[C@H](C[C@]1(C2)c1cccc(O)c1)NC(=O)C1(CCCCCC1)c1ccccc1
: