Target
Peroxisome proliferator-activated receptor gamma
Ligand
BDBM50195075
Substrate
Meas. Tech.
ChEMBL_424736 (CHEMBL907888)
Ki
1100±n/a nM
Citation
 Humphries, PSAlmaden, JVBarnum, SJCarlson, TJDo, QQFraser, JDHess, MKim, YHOgilvie, KMSun, S Pyridine-2-propanoic acids: Discovery of dual PPARalpha/gamma agonists as antidiabetic agents. Bioorg Med Chem Lett 16:6116-9 (2006)  
Target
Name:
Peroxisome proliferator-activated receptor gamma
Synonyms:
NR1C3 PPAR-gamma PPARG_HUMAN Peroxisome proliferator-activated receptor gamma (PPAR gamma) Peroxisome proliferator-activated receptor gamma (PPARĪ³) peroxisome proliferator-activated receptor gamma isoform 2
Type:
Nuclear Receptor
Mol. Mass.:
57613.46
Organism:
Homo sapiens (Human)
Description:
P37231
Residue:
505
  
Inhibitor
Name:
BDBM50195075
Synonyms:
2-ethoxy-3-(5-(3-(5-methyl-2-phenyloxazol-4-yl)propoxy)pyridin-2-yl)propanoic acid | CHEMBL221529
Type:
Small organic molecule
Emp. Form.:
C23H26N2O5
Mol. Mass.:
410.4629
SMILES:
CCOC(Cc1ccc(OCCCc2nc(oc2C)-c2ccccc2)cn1)C(O)=O
: