Target
Peroxisome proliferator-activated receptor alpha
Ligand
BDBM50195087
Substrate
Meas. Tech.
ChEMBL_424740 (CHEMBL907892)
EC50
1230±n/a nM
Citation
 Humphries, PSAlmaden, JVBarnum, SJCarlson, TJDo, QQFraser, JDHess, MKim, YHOgilvie, KMSun, S Pyridine-2-propanoic acids: Discovery of dual PPARalpha/gamma agonists as antidiabetic agents. Bioorg Med Chem Lett 16:6116-9 (2006)  
Target
Name:
Peroxisome proliferator-activated receptor alpha
Synonyms:
NR1C1 PPAR PPAR-alpha PPARA_HUMAN Peroxisome proliferator-activated receptor | Peroxisome proliferator-activated receptor alpha (PPAR alpha)
Type:
Enzyme
Mol. Mass.:
52222.08
Organism:
Homo sapiens (Human)
Description:
Q07869
Residue:
468
  
Inhibitor
Name:
BDBM50195087
Synonyms:
2-ethoxy-3-(5-(2-(5-methyl-2-phenyloxazol-4-yl)ethoxy)pyridin-2-yl)propanoic acid | CHEMBL373430
Type:
Small organic molecule
Emp. Form.:
C22H24N2O5
Mol. Mass.:
396.4364
SMILES:
CCOC(Cc1ccc(OCCc2nc(oc2C)-c2ccccc2)cn1)C(O)=O
: