Target
Peroxisome proliferator-activated receptor alpha
Ligand
BDBM50195081
Substrate
Meas. Tech.
ChEMBL_424737 (CHEMBL907889)
Ki
1800±n/a nM
Citation
 Humphries, PSAlmaden, JVBarnum, SJCarlson, TJDo, QQFraser, JDHess, MKim, YHOgilvie, KMSun, S Pyridine-2-propanoic acids: Discovery of dual PPARalpha/gamma agonists as antidiabetic agents. Bioorg Med Chem Lett 16:6116-9 (2006)  
Target
Name:
Peroxisome proliferator-activated receptor alpha
Synonyms:
NR1C1 PPAR PPAR-alpha PPARA_HUMAN Peroxisome proliferator-activated receptor | Peroxisome proliferator-activated receptor alpha (PPAR alpha)
Type:
Enzyme
Mol. Mass.:
52222.08
Organism:
Homo sapiens (Human)
Description:
Q07869
Residue:
468
  
Inhibitor
Name:
BDBM50195081
Synonyms:
2-((5-(2-(5-methyl-2-phenyloxazol-4-yl)ethoxy)pyridin-2-yl)methyl)-tetrahydro-2H-pyran-2-carboxylic acid | CHEMBL435512
Type:
Small organic molecule
Emp. Form.:
C24H26N2O5
Mol. Mass.:
422.4736
SMILES:
Cc1oc(nc1CCOc1ccc(CC2(CCCCO2)C(O)=O)nc1)-c1ccccc1
: