Target
Mitogen-activated protein kinase 1
Ligand
BDBM50195453
Substrate
Meas. Tech.
ChEMBL_424982 (CHEMBL910739)
Kd
16000±n/a nM
Citation
 Chen, FHancock, CNMacias, ATJoh, JStill, KZhong, SMacKerell, ADShapiro, P Characterization of ATP-independent ERK inhibitors identified through in silico analysis of the active ERK2 structure. Bioorg Med Chem Lett 16:6281-7 (2006)  
Target
Name:
Mitogen-activated protein kinase 1
Synonyms:
ERK2 Extracellular signal-regulated kinase 2 Extracellular signal-regulated kinase 2 (ERK2) MAPK 2 MK01_HUMAN Mitogen-activated protein kinase 1 (ERK-2) Mitogen-activated protein kinase 2 PRKM2 | p42-MAPK
Type:
Ser/Thr Protein Kinase
Mol. Mass.:
41392.76
Organism:
Homo sapiens (Human)
Description:
P28482
Residue:
360
  
Inhibitor
Name:
BDBM50195453
Synonyms:
5-(4-(4-bromobenzyloxy)-3-methoxybenzylidene)imidazolidine-2,4-dione | CHEMBL221096
Type:
Small organic molecule
Emp. Form.:
C18H15BrN2O4
Mol. Mass.:
403.227
SMILES:
COc1cc(\C=C2\NC(=O)NC2=O)ccc1OCc1ccc(Br)cc1
: