Target
Histone deacetylase
Ligand
BDBM19130
Substrate
Meas. Tech.
ChEMBL_416719 (CHEMBL909985)
IC50
0.4±n/a nM
Citation
 Mai, AMassa, SRotili, DSimeoni, SRagno, RBotta, GNebbioso, AMiceli, MAltucci, LBrosch, G Synthesis and biological properties of novel, uracil-containing histone deacetylase inhibitors. J Med Chem 49:6046-56 (2006)  
Target
Name:
Histone deacetylase
Synonyms:
Histone deacetylase HD1B
Type:
PROTEIN
Mol. Mass.:
50930.01
Organism:
Zea mays
Description:
ChEMBL_422128
Residue:
458
  
Inhibitor
Name:
BDBM19130
Synonyms:
(2E,4E,6R)-7-[4-(dimethylamino)phenyl]-N-hydroxy-4,6-dimethyl-7-oxohepta-2,4-dienamide TSA | Trichostatin A (TSA)
Type:
Small organic molecule
Emp. Form.:
C17H22N2O3
Mol. Mass.:
302.3682
SMILES:
CC(C=CC(=O)NO)C=C(C)C(=O)c1ccc(cc1)N(C)C
: