Target
Metabotropic glutamate receptor 1
Ligand
BDBM50197254
Substrate
Meas. Tech.
ChEMBL_453190 (CHEMBL902340)
Ki
3±n/a nM
Citation
 Owen, DRDodd, PGGayton, SGreener, BSHarbottle, GWMantell, SJMaw, GNOsborne, SARees, HRinger, TJRodriguez-Lens, MSmith, GF Structure-activity relationships of novel non-competitive mGluR1 antagonists: a potential treatment for chronic pain. Bioorg Med Chem Lett 17:486-90 (2007)  
Target
Name:
Metabotropic glutamate receptor 1
Synonyms:
GRM1_RAT Grm1 Metabotropic glutamate receptor Mglur1 metabotropic glutamate 1/5-D metabotropic glutamate receptor 1 isoform alpha precursor
Type:
Enzyme Catalytic Domain
Mol. Mass.:
133240.47
Organism:
RAT
Description:
metabotropic glutamate 1/2 0 RAT::P23385
Residue:
1199
  
Inhibitor
Name:
BDBM50197254
Synonyms:
CHEMBL246250 | N-((1r,4r)-4-methylcyclohexyl)-5-(piperidin-1-yl)pyrazine-2-carboxamide
Type:
Small organic molecule
Emp. Form.:
C17H26N4O
Mol. Mass.:
302.4145
SMILES:
C[C@H]1CC[C@@H](CC1)NC(=O)c1cnc(cn1)N1CCCCC1
: