Target
Prostaglandin G/H synthase 2
Ligand
BDBM50197394
Substrate
Meas. Tech.
ChEMBL_432254 (CHEMBL914032)
IC50
1700±n/a nM
Citation
 Zarghi, APraveen Rao, PNKnaus, EE Synthesis and biological evaluation of methanesulfonamide analogues of rofecoxib: Replacement of methanesulfonyl by methanesulfonamido decreases cyclooxygenase-2 selectivity. Bioorg Med Chem 15:1056-61 (2006)  
Target
Name:
Prostaglandin G/H synthase 2
Synonyms:
COX2 Cyclooxygenase-2 (COX-2) PTGS2 Prostaglandin G/H synthase (cyclooxygenase)
Type:
Protein
Mol. Mass.:
68976.98
Organism:
Ovis aries (Sheep)
Description:
Residue:
603
  
Inhibitor
Name:
BDBM50197394
Synonyms:
4-(4-methylsulfonamidophenyl)-3-phenyl-2(5H)furanone | CHEMBL435325
Type:
Small organic molecule
Emp. Form.:
C17H15NO4S
Mol. Mass.:
329.37
SMILES:
CS(=O)(=O)Nc1ccc(cc1)C1=C(C(=O)OC1)c1ccccc1
: