Target
Prostaglandin G/H synthase 1
Ligand
BDBM50197396
Substrate
Meas. Tech.
ChEMBL_432253 (CHEMBL914625)
IC50
>100000±n/a nM
Citation
 Zarghi, APraveen Rao, PNKnaus, EE Synthesis and biological evaluation of methanesulfonamide analogues of rofecoxib: Replacement of methanesulfonyl by methanesulfonamido decreases cyclooxygenase-2 selectivity. Bioorg Med Chem 15:1056-61 (2006)  
Target
Name:
Prostaglandin G/H synthase 1
Synonyms:
COX1 Cyclooxygenase-1 (COX-1) PTGS1 | Prostaglandin G/H synthase (cyclooxygenase)
Type:
Protein
Mol. Mass.:
68868.60
Organism:
Ovis aries (Sheep)
Description:
Residue:
600
  
Inhibitor
Name:
BDBM50197396
Synonyms:
3-(4-methylphenyl)-4-(4-methylsulfonamidophenyl)-2(5H)furanone | CHEMBL224323
Type:
Small organic molecule
Emp. Form.:
C18H17NO4S
Mol. Mass.:
343.397
SMILES:
Cc1ccc(cc1)C1=C(COC1=O)c1ccc(NS(C)(=O)=O)cc1
: