Target
Prostaglandin G/H synthase 2
Ligand
BDBM50197398
Substrate
Meas. Tech.
ChEMBL_432254 (CHEMBL914032)
IC50
800±n/a nM
Citation
 Zarghi, APraveen Rao, PNKnaus, EE Synthesis and biological evaluation of methanesulfonamide analogues of rofecoxib: Replacement of methanesulfonyl by methanesulfonamido decreases cyclooxygenase-2 selectivity. Bioorg Med Chem 15:1056-61 (2006)  
Target
Name:
Prostaglandin G/H synthase 2
Synonyms:
COX2 Cyclooxygenase-2 (COX-2) PTGS2 Prostaglandin G/H synthase (cyclooxygenase)
Type:
Protein
Mol. Mass.:
68976.98
Organism:
Ovis aries (Sheep)
Description:
Residue:
603
  
Inhibitor
Name:
BDBM50197398
Synonyms:
3-(4-chlorophenyl)-4-(4-methylsulfonamidophenyl)-2(5H)furanone | CHEMBL375881
Type:
Small organic molecule
Emp. Form.:
C17H14ClNO4S
Mol. Mass.:
363.815
SMILES:
CS(=O)(=O)Nc1ccc(cc1)C1=C(C(=O)OC1)c1ccc(Cl)cc1
: