Target
Type-2 angiotensin II receptor
Ligand
BDBM50199311
Substrate
Meas. Tech.
ChEMBL_411308 (CHEMBL907246)
Ki
0.50±n/a nM
Citation
 Wu, XWan, YMahalingam, AKMurugaiah, AMPlouffe, BBotros, MKarlén, AHallberg, MGallo-Payet, NAlterman, M Selective angiotensin II AT2 receptor agonists: arylbenzylimidazole structure-activity relationships. J Med Chem 49:7160-8 (2006)  
Target
Name:
Type-2 angiotensin II receptor
Synonyms:
AGTR2 AT2 Angiotensin II type 2 (AT-2) receptor Type-2 angiotensin II receptor
Type:
Enzyme Catalytic Domain
Mol. Mass.:
41201.61
Organism:
Homo sapiens (Human)
Description:
Angiotensin II, central 0 0::P50052
Residue:
363
  
Inhibitor
Name:
BDBM50199311
Synonyms:
CHEMBL215160 | N-butyloxycarbonyl-2-(4-imidazol-1-ylmethylphenyl)-4-butoxybenzenesulfonamide
Type:
Small organic molecule
Emp. Form.:
C25H31N3O5S
Mol. Mass.:
485.596
SMILES:
CCCCOC(=O)NS(=O)(=O)c1ccc(OCCCC)cc1-c1ccc(Cn2ccnc2)cc1
: