Target
Vascular endothelial growth factor receptor 2
Ligand
BDBM50201363
Substrate
Meas. Tech.
ChEMBL_453899 (CHEMBL885903)
Ki
0.17±n/a nM
Citation
 Kiselyov, ASPiatnitski, ELSamet, AVKisliy, VPSemenov, VV ortho-Substituted azoles as selective and dual inhibitors of VEGF receptors 1 and 2. Bioorg Med Chem Lett 17:1369-75 (2007)  
Target
Name:
Vascular endothelial growth factor receptor 2
Synonyms:
CD_antigen=CD309 Fetal liver kinase 1 (FLK-1) KDR Protein-tyrosine kinase receptor Flk-1 VEGFR-2 VEGFR2 Vascular Endothelial Growth Factor Receptor Kinase 2 Vascular endothelial growth factor receptor 2 (KDR) Vascular endothelial growth factor receptor 2 (VEGFR2) Vascular endothelial growth factor receptor-2 (VEGFR-2)
Type:
Receptor Tyrosine Kinase
Mol. Mass.:
151510.97
Organism:
Homo sapiens (Human)
Description:
P35968
Residue:
1356
  
Inhibitor
Name:
BDBM50201363
Synonyms:
1-methyl-4-(pyridin-4-ylmethylamino)-N-(4-(trifluoromethoxy)phenyl)-1H-pyrazole-5-carboxamide | CHEMBL401040
Type:
Small organic molecule
Emp. Form.:
C18H16F3N5O2
Mol. Mass.:
391.3471
SMILES:
Cn1ncc(NCc2ccncc2)c1C(=O)Nc1ccc(OC(F)(F)F)cc1
: