Target
Cytochrome P450 2C9
Ligand
BDBM50090677
Substrate
Meas. Tech.
ChEMBL_425258 (CHEMBL856834)
IC50
350±n/a nM
Citation
 Liverton, NJBednar, RABednar, BButcher, JWClaiborne, CFClaremon, DACunningham, MDiLella, AGGaul, SLLibby, BELyle, EALynch, JJMcCauley, JAMosser, SDNguyen, KTStump, GLSun, HWang, HYergey, JKoblan, KS Identification and characterization of 4-methylbenzyl 4-[(pyrimidin-2-ylamino)methyl]piperidine-1-carboxylate, an orally bioavailable, brain penetrant NR2B selective N-methyl-D-aspartate receptor antagonist. J Med Chem 50:807-19 (2007)  
Target
Name:
Cytochrome P450 2C9
Synonyms:
(R)-limonene 6-monooxygenase CP2C9_HUMAN CYP2C9 Cytochrome P450 2C9 (CYP2C9 ) P-450MP P450 PB-1 | S-mephenytoin 4-hydroxylase
Type:
Enzyme
Mol. Mass.:
55636.33
Organism:
Homo sapiens (Human)
Description:
P11712
Residue:
490
  
Inhibitor
Name:
BDBM50090677
Synonyms:
4-Amino-N-(2-phenyl-2H-pyrazol-3-yl)-benzenesulfonamide CHEMBL1109 Sulfabid US9180183, Sulfaphenazole
Type:
Small organic molecule
Emp. Form.:
C15H14N4O2S
Mol. Mass.:
314.362
SMILES:
Nc1ccc(cc1)S(=O)(=O)Nc1ccnn1-c1ccccc1
: