Target
C-C chemokine receptor type 8
Ligand
BDBM50203834
Substrate
Meas. Tech.
ChEMBL_425772 (CHEMBL855762)
Ki
0.7±n/a nM
Citation
 Jenkins, TJGuan, BDai, MLi, GLightburn, TEHuang, SFreeze, BSBurdi, DFJacutin-Porte, SBennett, RChen, WMinor, CGhosh, SBlackburn, CGigstad, KMJones, MKolbeck, RYin, WSmith, SCardillo, DOcain, TDHarriman, GC Design, synthesis, and evaluation of naphthalene-sulfonamide antagonists of human CCR8. J Med Chem 50:566-84 (2007)  
Target
Name:
C-C chemokine receptor type 8
Synonyms:
CCR8 CKRL1 CMKBRL2
Type:
PROTEIN
Mol. Mass.:
40855.53
Organism:
Homo sapiens (Human)
Description:
ChEMBL_454278
Residue:
355
  
Inhibitor
Name:
BDBM50203834
Synonyms:
2-methyl-N-{4-[({1-[(2S)-pyrrolidin-2-ylcarbonyl]piperidin-4-yl}amino)sulfonyl]-1-naphthyl}benzamide CHEMBL386308
Type:
Small organic molecule
Emp. Form.:
C28H32N4O4S
Mol. Mass.:
520.643
SMILES:
Cc1ccccc1C(=O)Nc1ccc(c2ccccc12)S(=O)(=O)NC1CCN(CC1)C(=O)[C@@H]1CCCN1
: