Target
C-C chemokine receptor type 8
Ligand
BDBM50203842
Substrate
Meas. Tech.
ChEMBL_425774 (CHEMBL855766)
IC50
9.5±n/a nM
Citation
 Jenkins, TJGuan, BDai, MLi, GLightburn, TEHuang, SFreeze, BSBurdi, DFJacutin-Porte, SBennett, RChen, WMinor, CGhosh, SBlackburn, CGigstad, KMJones, MKolbeck, RYin, WSmith, SCardillo, DOcain, TDHarriman, GC Design, synthesis, and evaluation of naphthalene-sulfonamide antagonists of human CCR8. J Med Chem 50:566-84 (2007)  
Target
Name:
C-C chemokine receptor type 8
Synonyms:
CCR8 CKRL1 CMKBRL2
Type:
PROTEIN
Mol. Mass.:
40855.53
Organism:
Homo sapiens (Human)
Description:
ChEMBL_454278
Residue:
355
  
Inhibitor
Name:
BDBM50203842
Synonyms:
CHEMBL222062 | N-(4-{[(1-butyrylpiperidin-4-yl)amino]sulfonyl}-1-naphthyl)-4-methylbenzamide
Type:
Small organic molecule
Emp. Form.:
C27H31N3O4S
Mol. Mass.:
493.618
SMILES:
CCCC(=O)N1CCC(CC1)NS(=O)(=O)c1ccc(NC(=O)c2ccc(C)cc2)c2ccccc12
: