Target
Dipeptidyl peptidase 4
Ligand
BDBM50205219
Substrate
Meas. Tech.
ChEMBL_442256 (CHEMBL892415)
IC50
3.5±n/a nM
Citation
 Kondo, TNekado, TSugimoto, IOchi, KTakai, SKinoshita, ATajima, YYamamoto, SKawabata, KNakai, HToda, M Design and synthesis of new potent dipeptidyl peptidase IV inhibitors with enhanced ex vivo duration. Bioorg Med Chem 15:2631-50 (2007)  
Target
Name:
Dipeptidyl peptidase 4
Synonyms:
ADABP Adenosine deaminase complexing protein 2 CD_antigen=CD26 DPP4 DPPIV Dipeptidyl peptidase 4 (DPP IV) Dipeptidyl peptidase 4 (DPP4) Dipeptidyl peptidase 4 membrane form Dipeptidyl peptidase IV Dipeptidyl peptidase IV (DDP-IV) Dipeptidyl peptidase IV membrane form Dipeptidyl peptidase-IV (DPP-4) T-cell activation antigen CD26 | TP103
Type:
Enzyme
Mol. Mass.:
88271.01
Organism:
Homo sapiens (Human)
Description:
P27487
Residue:
766
  
Inhibitor
Name:
BDBM50205219
Synonyms:
(3S,5S)-5-{[(2S)-2-cyano-1-pyrrolidinyl]carbonyl}-N-methyl-3-pyrrolidinecarboxamide | CHEMBL391559
Type:
Small organic molecule
Emp. Form.:
C12H18N4O2
Mol. Mass.:
250.2969
SMILES:
CNC(=O)[C@@H]1CN[C@@H](C1)C(=O)N1CCC[C@H]1C#N
: