Target
Prostaglandin D2 receptor
Ligand
BDBM50205274
Substrate
Meas. Tech.
ChEMBL_425870 (CHEMBL856874)
Ki
1.5±n/a nM
Citation
 Sturino, CFO'Neill, GLachance, NBoyd, MBerthelette, CLabelle, MLi, LRoy, BScheigetz, JTsou, NAubin, YBateman, KPChauret, NDay, SHLévesque, JFSeto, CSilva, JHTrimble, LACarriere, MCDenis, DGreig, GKargman, SLamontagne, SMathieu, MCSawyer, NSlipetz, DAbraham, WMJones, TMcAuliffe, MPiechuta, HNicoll-Griffith, DAWang, ZZamboni, RYoung, RNMetters, KM Discovery of a potent and selective prostaglandin D2 receptor antagonist, [(3R)-4-(4-chloro-benzyl)-7-fluoro-5-(methylsulfonyl)-1,2,3,4-tetrahydrocyclopenta[b]indol-3-yl]-acetic acid (MK-0524). J Med Chem 50:794-806 (2007)  
Target
Name:
Prostaglandin D2 receptor
Synonyms:
PD2R_HUMAN Prostaglandin D2 Prostanoid DP receptor
Type:
Enzyme
Mol. Mass.:
40288.87
Organism:
Homo sapiens (Human)
Description:
Q13258
Residue:
359
  
Inhibitor
Name:
BDBM50205274
Synonyms:
CHEMBL426387 | [(3R)-5-bromo-4-(4-chlorobenzyl)-7-fluoro-1,2,3,4-tetrahydrocyclopenta[b]indol-3-yl]acetic acid
Type:
Small organic molecule
Emp. Form.:
C20H16BrClFNO2
Mol. Mass.:
436.702
SMILES:
OC(=O)C[C@H]1CCc2c1n(Cc1ccc(Cl)cc1)c1c(Br)cc(F)cc21
: