Target
Gamma-aminobutyric acid receptor subunit alpha-1/beta-2/gamma-2
Ligand
BDBM50205615
Substrate
Meas. Tech.
ChEMBL_435782 (CHEMBL904137)
Ki
2.6±n/a nM
Citation
 Guerrini, GCiciani, GCambi, GBruni, FSelleri, SBesnard, FMontali, MMartini, CGhelardini, CGaleotti, NCostanzo, A Novel 3-iodo-8-ethoxypyrazolo[5,1-c][1,2,4]benzotriazine 5-oxide as promising lead for design of alpha5-inverse agonist useful tools for therapy of mnemonic damage. Bioorg Med Chem 15:2573-86 (2007)  
Target
Name:
Gamma-aminobutyric acid receptor subunit alpha-1/beta-2/gamma-2
Synonyms:
GABA receptor alpha-1/beta-2/gamma-2 subunit GABAA Subunit α1β2γ2 | GABAA Subunit alpha-1, beta-2, gamma-2
Type:
Mol. Mass.:
Description:
ASSAY_ID of EBI is 69455
Components:
This complex has 3 components.
Component 1
Name:
Gamma-aminobutyric acid receptor subunit beta-2
Synonyms:
GBRB2_RAT Gabrb2 | Gamma-aminobutyric acid receptor subunit beta-2 (GABA(A) beta-2)
Type:
Enzyme
Mol. Mass.:
54648.97
Organism:
Rattus norvegicus (Rat)
Description:
P63138
Residue:
474
  
Component 2
Name:
Gamma-aminobutyric acid receptor subunit gamma-2
Synonyms:
GBRG2_RAT Gamma-aminobutyric acid receptor subunit gamma-2 (GABA(A) gamma-2)
Type:
Enzyme
Mol. Mass.:
54087.63
Organism:
Rattus norvegicus (Rat)
Description:
P18508
Residue:
466
  
Component 3
Name:
Gamma-aminobutyric acid receptor subunit alpha-1
Synonyms:
Benzodiazepine central GABA A Benzodiazepine GABA A Benzodiazepine Type II GABA A Benzodiazepine Type IIM GABA A Benzodiazepine omega2 GABA A alpha1 GABA receptor alpha-1 subunit GABA-PICROTOXIN Gabra-1 TBPS
Type:
Enzyme
Mol. Mass.:
51770.21
Organism:
Rattus norvegicus (Rat)
Description:
P62813
Residue:
455
  
Inhibitor
Name:
BDBM50205615
Synonyms:
3-iodo-8-ethoxypyrazolo[5,1-c][1,2,4]benzotriazine4-oxide | CHEMBL229145
Type:
Small organic molecule
Emp. Form.:
C11H9IN4O2
Mol. Mass.:
356.1192
SMILES:
CCOc1ccc2n[n+]([O-])c3c(I)cnn3c2c1
: